解決Execution failed for task ‘:app:checkDebugAarMetadata‘的问题

2024-06-08 14:48

本文主要是介绍解決Execution failed for task ‘:app:checkDebugAarMetadata‘的问题,希望对大家解决编程问题提供一定的参考价值,需要的开发者们随着小编来一起学习吧!

在更新fullter后就报以下问题:

FAILURE: Build failed with an exception.* What went wrong:
Execution failed for task ':app:checkDebugAarMetadata'.
> Multiple task action failures occurred:> A failure occurred while executing com.android.build.gradle.internal.tasks.CheckAarMetadataWorkAction> The minCompileSdk (31) specified in adependency's AAR metadata (META-INF/com/android/build/gradle/aar-metadata.properties)is greater than this module's compileSdkVersion (android-30).Dependency: androidx.window:window-java:1.0.0-beta04.AAR metadata file: C:\Users\liqiang\.gradle\caches\transforms-2\files-2.1\9f515ee58db509b5f4759e97c8eb6aa2\jetified-window-java-1.0.0-beta04\META-INF\com\android\build\gradle\aar-metadata.properties.> A failure occurred while executing com.android.build.gradle.internal.tasks.CheckAarMetadataWorkAction> The minCompileSdk (31) specified in adependency's AAR metadata (META-INF/com/android/build/gradle/aar-metadata.properties)is greater than this module's compileSdkVersion (android-30).Dependency: androidx.window:window:1.0.0-beta04.AAR metadata file: C:\Users\liqiang\.gradle\caches\transforms-2\files-2.1\a909ff21160c236fa8213aba5c707997\jetified-window-1.0.0-beta04\META-INF\com\android\build\gradle\aar-metadata.properties.
* Try:
Run with --stacktrace option to get the stack trace. Run with --info or --debug option to get more log output. Run with --scan to get full insights.* Get more help at https://help.gradle.orgBUILD FAILED in 4s
Exception: Gradle task assembleDebug failed with exit code 1

根据报错信息The minCompileSdk (31) specified 提示说需要最后sdk是31版本的,但是我们现在sdk版本是30的,大于这个版本所以需要修改以下配置,都修改成31的
在这里插入图片描述

android {compileSdkVersion 31sourceSets {main.java.srcDirs += 'src/main/kotlin'}defaultConfig {// TODO: Specify your own unique Application ID (https://developer.android.com/studio/build/application-id.html)./*configurations.all {resolutionStrategy { force 'androidx.core:core-ktx:1.6.0' }}*/applicationId "cn.liginfo.kqjhq_app"minSdkVersion 16targetSdkVersion 31versionCode flutterVersionCode.toInteger()versionName flutterVersionName}buildTypes {release {// TODO: Add your own signing config for the release build.// Signing with the debug keys for now, so `flutter run --release` works.signingConfig signingConfigs.debug}}
}

修改之后,因为没有31版本的sdk,它会自动下载,但是下载后又出现以下报错信息

Flutter assets will be downloaded from https://storage.flutter-io.cn. Make sure you trust this source!
Launching lib\main.dart on sdk gphone x86 arm in debug mode...
Running Gradle task 'assembleDebug'...
e: C:/Users/liqiang/.gradle/caches/transforms-2/files-2.1/0dd39ff9faeeb501ffb52162e269003e/jetified-kotlin-stdlib-1.5.31.jar!/META-INF/kotlin-stdlib.kotlin_module: Module was compiled with an incompatible version of Kotlin. The binary version of its metadata is 1.5.1, expected version is 1.1.15.
e: C:/Users/liqiang/.gradle/caches/transforms-2/files-2.1/2ea246a87a592f122121cfd0846ffbea/jetified-kotlin-stdlib-jdk7-1.5.30.jar!/META-INF/kotlin-stdlib-jdk7.kotlin_module: Module was compiled with an incompatible version of Kotlin. The binary version of its metadata is 1.5.1, expected version is 1.1.15.
e: C:/Users/liqiang/.gradle/caches/transforms-2/files-2.1/9234cfcee40ec23fc2213363e9726513/jetified-window-1.0.0-beta04-api.jar!/META-INF/window_release.kotlin_module: Module was compiled with an incompatible version of Kotlin. The binary version of its metadata is 1.5.1, expected version is 1.1.15.
e: C:/Users/liqiang/.gradle/caches/transforms-2/files-2.1/9af1d6ff9000d18681a83cd875960957/jetified-kotlinx-coroutines-core-jvm-1.5.2.jar!/META-INF/kotlinx-coroutines-core.kotlin_module: Module was compiled with an incompatible version of Kotlin. The binary version of its metadata is 1.5.1, expected version is 1.1.15.
e: C:/Users/liqiang/.gradle/caches/transforms-2/files-2.1/b0b1eecff74e71ed1ef092403ad1018c/jetified-kotlin-stdlib-common-1.5.31.jar!/META-INF/kotlin-stdlib-common.kotlin_module: Module was compiled with an incompatible version of Kotlin. The binary version of its metadata is 1.5.1, expected version is 1.1.15.
e: C:/Users/liqiang/.gradle/caches/transforms-2/files-2.1/d91778f7878bf943ae593906c9fd7c75/jetified-kotlin-stdlib-jdk8-1.5.30.jar!/META-INF/kotlin-stdlib-jdk8.kotlin_module: Module was compiled with an incompatible version of Kotlin. The binary version of its metadata is 1.5.1, expected version is 1.1.15.
e: C:/Users/liqiang/.gradle/caches/transforms-2/files-2.1/df6880e9350e429186aa0973bbf49093/jetified-window-java-1.0.0-beta04-api.jar!/META-INF/window-java_release.kotlin_module: Module was compiled with an incompatible version of Kotlin. The binary version of its metadata is 1.5.1, expected version is 1.1.15.
e: C:/Users/liqiang/.gradle/caches/transforms-2/files-2.1/e484fc5cda5fe73d156ca3b50e47d38e/jetified-kotlinx-coroutines-android-1.5.2.jar!/META-INF/kotlinx-coroutines-android.kotlin_module: Module was compiled with an incompatible version of Kotlin. The binary version of its metadata is 1.5.1, expected version is 1.1.15.FAILURE: Build failed with an exception.* What went wrong:
Execution failed for task ':app:compileDebugKotlin'.
> Compilation error. See log for more details* Try:
Run with --stacktrace option to get the stack trace. Run with --info or --debug option to get more log output. Run with --scan to get full insights.* Get more help at https://help.gradle.orgBUILD FAILED in 7s┌─ Flutter Fix ────────────────────────────────────────────────────────────────────────────────┐
│ [!] Your project requires a newer version of the Kotlin Gradle plugin.                       │
│ Find the latest version on https://kotlinlang.org/docs/gradle.html#plugin-and-versions, then │
│ update D:\javadeveloping\Android\workspace\kqjhq_app\android\build.gradle:                   │
│ ext.kotlin_version = '<latest-version>'                                                      │
└──────────────────────────────────────────────────────────────────────────────────────────────┘
Exception: Gradle task assembleDebug failed with exit code 1

从报错信息中说是kotlin的版本不对,而且给出了具体的解决方案

Your project requires a newer version of the Kotlin Gradle plugin.                       │
│ Find the latest version on https://kotlinlang.org/docs/gradle.html#plugin-and-versions, then │
│ update D:\javadeveloping\Android\workspace\kqjhq_app\android\build.gradle:                   │
│ ext.kotlin_version = '<latest-version>'   

你需要一个最新的kotlin gradle的插件,在https://kotlinlang.org/docs/gradle.html#plugin-and-versions查找最近的版本后,更新D:\javadeveloping\Android\workspace\kqjhq_app\android\build.gradle的文件,中ext.kotlin_version = ‘’ 的latest-version的值。
在这里插入图片描述
打开网页后我们发现最新的版本是1.6.10,而我们以前的是1.3.5:
在这里插入图片描述
只需改成1.6.10的版本就正常打包了

这篇关于解決Execution failed for task ‘:app:checkDebugAarMetadata‘的问题的文章就介绍到这儿,希望我们推荐的文章对编程师们有所帮助!



http://www.chinasem.cn/article/1042490

相关文章

SpringBoot启动报错的11个高频问题排查与解决终极指南

《SpringBoot启动报错的11个高频问题排查与解决终极指南》这篇文章主要为大家详细介绍了SpringBoot启动报错的11个高频问题的排查与解决,文中的示例代码讲解详细,感兴趣的小伙伴可以了解一... 目录1. 依赖冲突:NoSuchMethodError 的终极解法2. Bean注入失败:No qu

MySQL新增字段后Java实体未更新的潜在问题与解决方案

《MySQL新增字段后Java实体未更新的潜在问题与解决方案》在Java+MySQL的开发中,我们通常使用ORM框架来映射数据库表与Java对象,但有时候,数据库表结构变更(如新增字段)后,开发人员可... 目录引言1. 问题背景:数据库与 Java 实体不同步1.1 常见场景1.2 示例代码2. 不同操作

如何解决mysql出现Incorrect string value for column ‘表项‘ at row 1错误问题

《如何解决mysql出现Incorrectstringvalueforcolumn‘表项‘atrow1错误问题》:本文主要介绍如何解决mysql出现Incorrectstringv... 目录mysql出现Incorrect string value for column ‘表项‘ at row 1错误报错

如何解决Spring MVC中响应乱码问题

《如何解决SpringMVC中响应乱码问题》:本文主要介绍如何解决SpringMVC中响应乱码问题,具有很好的参考价值,希望对大家有所帮助,如有错误或未考虑完全的地方,望不吝赐教... 目录Spring MVC最新响应中乱码解决方式以前的解决办法这是比较通用的一种方法总结Spring MVC最新响应中乱码解

pip无法安装osgeo失败的问题解决

《pip无法安装osgeo失败的问题解决》本文主要介绍了pip无法安装osgeo失败的问题解决,文中通过示例代码介绍的非常详细,对大家的学习或者工作具有一定的参考学习价值,需要的朋友们下面随着小编来一... 进入官方提供的扩展包下载网站寻找版本适配的whl文件注意:要选择cp(python版本)和你py

解决Java中基于GeoTools的Shapefile读取乱码的问题

《解决Java中基于GeoTools的Shapefile读取乱码的问题》本文主要讨论了在使用Java编程语言进行地理信息数据解析时遇到的Shapefile属性信息乱码问题,以及根据不同的编码设置进行属... 目录前言1、Shapefile属性字段编码的情况:一、Shp文件常见的字符集编码1、System编码

Spring MVC使用视图解析的问题解读

《SpringMVC使用视图解析的问题解读》:本文主要介绍SpringMVC使用视图解析的问题解读,具有很好的参考价值,希望对大家有所帮助,如有错误或未考虑完全的地方,望不吝赐教... 目录Spring MVC使用视图解析1. 会使用视图解析的情况2. 不会使用视图解析的情况总结Spring MVC使用视图

Redis解决缓存击穿问题的两种方法

《Redis解决缓存击穿问题的两种方法》缓存击穿问题也叫热点Key问题,就是⼀个被高并发访问并且缓存重建业务较复杂的key突然失效了,无数的请求访问会在瞬间给数据库带来巨大的冲击,本文给大家介绍了Re... 目录引言解决办法互斥锁(强一致,性能差)逻辑过期(高可用,性能优)设计逻辑过期时间引言缓存击穿:给

Android App安装列表获取方法(实践方案)

《AndroidApp安装列表获取方法(实践方案)》文章介绍了Android11及以上版本获取应用列表的方案调整,包括权限配置、白名单配置和action配置三种方式,并提供了相应的Java和Kotl... 目录前言实现方案         方案概述一、 androidManifest 三种配置方式

Java程序运行时出现乱码问题的排查与解决方法

《Java程序运行时出现乱码问题的排查与解决方法》本文主要介绍了Java程序运行时出现乱码问题的排查与解决方法,包括检查Java源文件编码、检查编译时的编码设置、检查运行时的编码设置、检查命令提示符的... 目录一、检查 Java 源文件编码二、检查编译时的编码设置三、检查运行时的编码设置四、检查命令提示符