编译方法详见libjingle\README

2023-12-11 18:32

本文主要是介绍编译方法详见libjingle\README,希望对大家解决编程问题提供一定的参考价值,需要的开发者们随着小编来一起学习吧!

http://hi.baidu.com/eve2006/item/df70f1e53e49ebadcf2d4fa3


编译方法详见libjingle\README

cmd:
 安装python
set PYTHON=c:\Python27
 (如果使用exe安装Scons则会安装到Python的目录里,
 使用scons-2.1.0报错:TypeError: object of type 'Dir' has no len():,
 使用scons-2.0.1进入编译,scons-2.0.1下载地址:http://www.ddxia.com/view/128928115336406.html,
 参考资料:http://www.aiseminar.cn/bbs/forum.php?mod=viewthread&tid=1858)
 #set SCONS_DIR=C:\Python27\Lib\site-packages\scons-2.1.0
set SCONS_DIR=C:\Python27\Lib\site-packages\scons-2.0.1
set PATH_TO_SWTOOLKIT=C:\1-MyWork\libjingle\depends\swtoolkit\swtoolkit
set PATH=%PYTHON%;%SCONS_DIR%;%PATH_TO_SWTOOLKIT%;%PATH%
 拷贝expat、gtest、srtp到libjingle-...\talk\third_party
cd C:\1-MyWork\libjingle-...\talk
%PATH_TO_SWTOOLKIT%\hammer.bat

如果出现如下错误
scons: Building targets ...
________Compiling build\dbg\obj\xmpp\mucroomhistorytask.obj
mucroomhistorytask.cc
c:\1-mywork\libjingle\libjingle-0.6.10\talk\xmpp\mucroomhistorytask.cc : error C
2220: warning treated as error - no 'object' file generated
c:\1-mywork\libjingle\libjingle-0.6.10\talk\xmpp\mucroomhistorytask.cc : warning
 C4819: The file contains a character that cannot be represented in the current
code page (936). Save the file in Unicode format to prevent data loss
scons: *** [build\dbg\obj\xmpp\mucroomhistorytask.obj] Error 2
scons: building terminated because of errors.

是由于注释当中的“,”引起,该字符是unicode编码,替换成ANSI编码即可

//   <iq type='result'
//       
//       id='user-setting-1'>
//     <meetinghistory xmlns='google:setting'>
//       <item name=’Hangout'
//             time=’2011-01-31T13:20:00Z’ />
//       <item name=’Planning’
//             time=’2011-02-11T 14:20:00Z />
//       <item name=’TGIF’
//             time=’2011-03-21T15:20:00Z’ />
//     </meetinghistory>
//   </iq>

cygwin:
#export PYTHON=/cygdrive/c/Python27
export SCONS_DIR=/cygdrive/c/1-MyWork/src/SCons/SCons-local-2.1.0/scons-local-2.1.0
export PATH_TO_SWTOOLKIT=/cygdrive/c/1-MyWork/src/swtoolkit/swtoolkit
#export PATH=$PYTHON:$SCONS_DIR:$PATH_TO_SWTOOLKIT:$PATH
export PATH=$SCONS_DIR:$PATH_TO_SWTOOLKIT:$PATH
$PATH_TO_SWTOOLKIT/hammer.sh

linux-ubuntu:
sudo apt-get install libgtk2.0-dev
sudo apt-get install libssl-dev
sudo apt-get install libasound2-dev
 scons使用scons-local-2.0.1,下载并解压到某个目录
export SCONS_DIR=/home/leery/libjingle/depends/SCons/scons-local-2.0.1/scons-local-2.0.1
 下载swtoolkit并解压到某个目录
export PATH_TO_SWTOOLKIT=/home/leery/libjingle/depends/swtoolkit/swtoolkit
export PATH=$SCONS_DIR:$PATH_TO_SWTOOLKIT:$PATH
 下载expat-2.0.1并放到talk/third_party/目录下
cd talk/third_party/expat-2.0.1/
./configure
 下载srtp并放到talk/third_party/目录下
cd ../srtp/
./configure
cd ../..
$PATH_TO_SWTOOLKIT/hammer.sh

如果出现如下错误
________Compiling build/dbg/obj/base/linux_unittest.o
base/linux_unittest.cc:32:32: error: testing/base/gunit.h: 没有那个文件或目录
base/linux_unittest.cc:38: error: ‘GetProcInfo’ has not been declared
base/linux_unittest.cc:38: error: ISO C++ forbids declaration of ‘TEST’ with no type
base/linux_unittest.cc: In function ‘int talk_base::TEST(talk_base::ProcCpuInfo, int)’:
base/linux_unittest.cc:40: error: ‘EXPECT_TRUE’ was not declared in this scope
base/linux_unittest.cc:45: error: ‘EXPECT_GT’ was not declared in this scope
base/linux_unittest.cc:51: error: ‘EXPECT_LE’ was not declared in this scope
base/linux_unittest.cc:56: error: ‘EXPECT_GE’ was not declared in this scope
base/linux_unittest.cc:78: error: ‘EXPECT_EQ’ was not declared in this scope
base/linux_unittest.cc:83: error: ‘EXPECT_FALSE’ was not declared in this scope
cc1plus: warnings being treated as errors
base/linux_unittest.cc:85: error: no return statement in function returning non-void
base/linux_unittest.cc: At global scope:
base/linux_unittest.cc:87: error: ‘ParseConfig’ has not been declared
base/linux_unittest.cc:87: error: ISO C++ forbids declaration of ‘TEST’ with no type
base/linux_unittest.cc: In function ‘int talk_base::TEST(talk_base::ConfigParser, int)’:
base/linux_unittest.cc:97: error: ‘EXPECT_EQ’ was not declared in this scope
base/linux_unittest.cc:106: error: no return statement in function returning non-void
base/linux_unittest.cc: At global scope:
base/linux_unittest.cc:108: error: expected constructor, destructor, or type conversion before ‘(’ token
base/linux_unittest.cc:114: error: expected constructor, destructor, or type conversion before ‘(’ token
scons: *** [build/dbg/obj/base/linux_unittest.o] Error 1
scons: building terminated because of errors.
打开talk/base/linux_unittest.cc,将
#include "testing/base/gunit.h"
改为
#include "talk/base/gunit.h"
即可


这篇关于编译方法详见libjingle\README的文章就介绍到这儿,希望我们推荐的文章对编程师们有所帮助!



http://www.chinasem.cn/article/481680

相关文章

Linux换行符的使用方法详解

《Linux换行符的使用方法详解》本文介绍了Linux中常用的换行符LF及其在文件中的表示,展示了如何使用sed命令替换换行符,并列举了与换行符处理相关的Linux命令,通过代码讲解的非常详细,需要的... 目录简介检测文件中的换行符使用 cat -A 查看换行符使用 od -c 检查字符换行符格式转换将

Java编译生成多个.class文件的原理和作用

《Java编译生成多个.class文件的原理和作用》作为一名经验丰富的开发者,在Java项目中执行编译后,可能会发现一个.java源文件有时会产生多个.class文件,从技术实现层面详细剖析这一现象... 目录一、内部类机制与.class文件生成成员内部类(常规内部类)局部内部类(方法内部类)匿名内部类二、

SpringBoot实现数据库读写分离的3种方法小结

《SpringBoot实现数据库读写分离的3种方法小结》为了提高系统的读写性能和可用性,读写分离是一种经典的数据库架构模式,在SpringBoot应用中,有多种方式可以实现数据库读写分离,本文将介绍三... 目录一、数据库读写分离概述二、方案一:基于AbstractRoutingDataSource实现动态

Java中的String.valueOf()和toString()方法区别小结

《Java中的String.valueOf()和toString()方法区别小结》字符串操作是开发者日常编程任务中不可或缺的一部分,转换为字符串是一种常见需求,其中最常见的就是String.value... 目录String.valueOf()方法方法定义方法实现使用示例使用场景toString()方法方法

Java中List的contains()方法的使用小结

《Java中List的contains()方法的使用小结》List的contains()方法用于检查列表中是否包含指定的元素,借助equals()方法进行判断,下面就来介绍Java中List的c... 目录详细展开1. 方法签名2. 工作原理3. 使用示例4. 注意事项总结结论:List 的 contain

macOS无效Launchpad图标轻松删除的4 种实用方法

《macOS无效Launchpad图标轻松删除的4种实用方法》mac中不在appstore上下载的应用经常在删除后它的图标还残留在launchpad中,并且长按图标也不会出现删除符号,下面解决这个问... 在 MACOS 上,Launchpad(也就是「启动台」)是一个便捷的 App 启动工具。但有时候,应

SpringBoot日志配置SLF4J和Logback的方法实现

《SpringBoot日志配置SLF4J和Logback的方法实现》日志记录是不可或缺的一部分,本文主要介绍了SpringBoot日志配置SLF4J和Logback的方法实现,文中通过示例代码介绍的非... 目录一、前言二、案例一:初识日志三、案例二:使用Lombok输出日志四、案例三:配置Logback一

Python实现无痛修改第三方库源码的方法详解

《Python实现无痛修改第三方库源码的方法详解》很多时候,我们下载的第三方库是不会有需求不满足的情况,但也有极少的情况,第三方库没有兼顾到需求,本文将介绍几个修改源码的操作,大家可以根据需求进行选择... 目录需求不符合模拟示例 1. 修改源文件2. 继承修改3. 猴子补丁4. 追踪局部变量需求不符合很

mysql出现ERROR 2003 (HY000): Can‘t connect to MySQL server on ‘localhost‘ (10061)的解决方法

《mysql出现ERROR2003(HY000):Can‘tconnecttoMySQLserveron‘localhost‘(10061)的解决方法》本文主要介绍了mysql出现... 目录前言:第一步:第二步:第三步:总结:前言:当你想通过命令窗口想打开mysql时候发现提http://www.cpp

Mysql删除几亿条数据表中的部分数据的方法实现

《Mysql删除几亿条数据表中的部分数据的方法实现》在MySQL中删除一个大表中的数据时,需要特别注意操作的性能和对系统的影响,本文主要介绍了Mysql删除几亿条数据表中的部分数据的方法实现,具有一定... 目录1、需求2、方案1. 使用 DELETE 语句分批删除2. 使用 INPLACE ALTER T